{"text_format":"3","workbook":"xlsx","n_sheets":15,"sheets":["BOQ","Estimate Markup","01 Material Prices","02 Equipment","03 Labour","04 Subcontract","05 Built-in Preliminaries","06 Material Transp.","07 ExtraOver Haulage","08 Concrete","09 Asphalt Binder","10 Blockworks","11 Laterite Fillings","12 Road Scarify","13 Prime Coat"],"not_rendered":{"external_links":13,"defined_names":753},"read":"whole","date_system":"1900"}

{"sheet":"BOQ","index":0,"n_rows":56,"n_cols":16,"rows_kept":56,"merged":[[0,0,1,0],[1,4,1,5],[1,7,1,8]]}
["LEGEND","COST TO CONSTRUCT",{"$nulls":5},"Markup",{"$f":"'Estimate Markup'!C37","v":4.171},{"$nulls":5},"PS","PC"]
[null,"OFFER TO CLIENT",null,null,"COST TO CONSTRUCT",null,null,"OFFER TO CLIENT",{"$nulls":6},{"$f":"SUM(M3:M57)","v":{"v":5000000,"d":"5,000,000.00"}},{"$f":"SUM(N3:N57)","v":{"v":7500000,"d":"7,500,000.00"}}]
[]
["CODE","DESCRIPTION","QTY","UNIT","RATE","AMOUNT",null,"RATE","AMOUNT"]
[]
[{"v":1,"d":"1.00"},"BUILDING WORKS"]
[]
[null,"1.5 EXCAVATION AND FILLING"]
[null,"FILLING"]
["1.5.12.2.1.1","Imported filling, bed not exceeding 500mm deep, 350mm thick, leveled to falls in foundation",365,"m3",{"$f":"'11 Laterite Fillings'!D50","v":{"v":1170,"d":"1,170.00"}},{"$f":"E10*C10","v":{"v":427050,"d":"427,050.00"}},null,{"$f":"ROUND(E10*$I$1,0)","v":{"v":4880,"d":"4,880.00"}},{"$f":"H10*C10","v":{"v":1781200,"d":"1,781,200.00"}}]
{"$rows_left_out":47}
{"sheet":"Estimate Markup","index":1,"n_rows":37,"n_cols":7,"rows_kept":37}
[null,"Project Staff",null,{"$f":"'05 Built-in Preliminaries'!G45","v":{"v":14080000,"d":"14,080,000.00"}}]
[null,"Site Accommodation",null,{"$f":"'05 Built-in Preliminaries'!G46","v":{"v":9200000,"d":"9,200,000.00"}}]
[null,"Transportation",null,{"$f":"'05 Built-in Preliminaries'!G47","v":{"v":12137500,"d":"12,137,500.00"}}]
[null,"Scaffolding/Shuttering",null,{"$f":"'05 Built-in Preliminaries'!G48","v":{"v":37200000,"d":"37,200,000.00"}}]
[null,"Site Equipment",null,{"$f":"'05 Built-in Preliminaries'!G49","v":{"v":72925000,"d":"72,925,000.00"}}]
[null,"Insurance & Bond",null,{"$f":"'05 Built-in Preliminaries'!G50","v":{"v":12905300,"d":"12,905,300.00"}}]
[null,"Total In-built Preliminaries",null,{"$f":"SUM(D1:D6)*E7","v":{"v":158447800,"d":"158,447,800.00"}},{"v":1,"d":"100%"}]
[null,"Actual Measured Works",null,{"$f":"BOQ!F51","v":{"v":109571565.01384269,"d":"109,571,565.01"}}]
[null,"Total Cost",null,{"$f":"D8+D7","v":{"v":268019365.0138427,"d":"268,019,365.01"}}]
[null,"ADD-Ons"]
{"$rows_left_out":28}
{"sheet":"01 Material Prices","index":2,"n_rows":17,"n_cols":10,"rows_kept":17}
["S/NO","MATERIAL PRICES","AMOUNT","UNIT",null,null,"Vendor Price Adjustment"]
[{"v":1,"d":"1.0"},"CEMENT  N / TON",{"$f":"C3*20","v":{"v":75712.5,"d":"75,712.5"}},"COST / TON",null,null,"Material Supplied to Site",null,225,150]
[{"v":2,"d":"2.0"},"CEMENT  N / BAG",{"$f":"I17","v":{"v":3785.625,"d":"3,785.6"}},"COST / BAG",null,1,"Suppply 225mm Sandcrete Block",null,230,190]
[{"v":3,"d":"3.0"},"CHIPPINGS",{"v":12500,"d":"12,500.0"},"COST / M3",null,null,"Transportation",null,5,5]
[{"v":4,"d":"4.0"},"SAND",{"v":3000,"d":"3,000.0"},{"$f":"D4","v":"COST / M3"},null,null,"Loading & Offloading",null,5,5]
[{"v":5,"d":"5.0"},"STONE DUST",{"v":12500,"d":"12,500.0"},{"$f":"D4","v":"COST / M3"},null,null,"Subtotal",null,{"$f":"SUM(I3:I5)","v":{"v":240,"d":"240.0"}},{"$f":"SUM(J3:J5)","v":{"v":200,"d":"200.0"}}]
[{"v":6,"d":"6.0"},"STONE BASE",{"v":10353,"d":"10,353.0"},{"$f":"D4","v":"COST / M3"},null,null,"VAT",{"v":0.075,"d":"7.50%"},{"$f":"I6*H7","v":18},{"$f":"J6*H7","v":15}]
[{"v":7,"d":"7.0"},"HARD CORE   ",{"v":10370,"d":"10,370.0"},{"$f":"D5","v":"COST / M3"},null,null,"WHT",{"v":0.05,"d":"5.00%"},{"$f":"I6*H8","v":12},{"$f":"J6*H8","v":10}]
[{"v":8,"d":"8.0"},"225 BLOCK",{"$f":"I9","v":{"v":270,"d":"270.0"}},"COST / BLOCK",{"$nulls":4},{"$f":"SUM(I6:I8)","v":{"v":270,"d":"270.0"}},{"$f":"SUM(J6:J8)","v":{"v":225,"d":"225.0"}}]
[{"v":9,"d":"9.0"},"150 BLOCK",{"$f":"J9","v":{"v":225,"d":"225.0"}},"COST / BLOCK"]
{"$rows_left_out":8}
{"sheet":"02 Equipment","index":3,"n_rows":23,"n_cols":26,"rows_kept":23}
["EQUIPMENT ","PRICE\n (CFI, Lagos)","CUSTOM\nDUTY (%)","COST OF DUTY","TOTAL COST","COST IN NAIRA ($1/N380)","EQUIPMENT LIFESPAN","DEPRECIATION","FUEL CONSUMPTION","COST OF FUEL","MAINTENANCE\n35% OF DEPRE.","FUEL COST / DAY","LUB\n8% OF FUEL","DAILY COST","OPERATOR","TOTAL\nCOST",null,"S/NO","RENTED EQUIPMENT`","RENTAL COST/\nDAY (8 HRS)","FUEL COST / DAY","OPERATOR\n COST/DY","TOTAL COST/DAY ",null,null,"EQUIPMENT COST/\nDAY (8 HRS)"]
["Asphalt Paver (2.5m)",{"v":250000,"d":"250,000.00"},{"v":0.0812,"d":"0.08"},{"$f":"C2*B2","v":{"v":20300,"d":"20,300.00"}},{"$f":"D2+B2","v":{"v":270300,"d":"270,300.00"}},{"$f":"E2*380","v":{"v":102714000,"d":"102,714,000.00"}},{"v":7,"d":"7.00"},{"$f":"F2/(G2*12*25)","v":{"v":48911.42857142857,"d":"48,911.43"}},{"v":162,"d":"162.00"},{"v":270,"d":"270.00"},{"$f":"H2*35%","v":{"v":17119,"d":"17,119.00"}},{"$f":"J2*I2","v":{"v":43740,"d":"43,740.00"}},{"$f":"L2*8%","v":{"v":3499.2000000000003,"d":"3,499.20"}},{"$f":"M2+L2+K2+H2","v":{"v":113269.62857142856,"d":"113,269.63"}},{"v":10000,"d":"10,000.00"},{"$f":"O2+N2","v":{"v":123269.62857142856,"d":"123,269.63"}},null,1,"Asphalt Paver (2.5m)",{"$f":"ROUND(Z2,-3)","v":{"v":82000,"d":"82,000.00"}},{"$f":"L2","v":{"v":43740,"d":"43,740.00"}},{"v":10000,"d":"10,000.00"},{"$f":"T2+U2+V2","v":{"v":135740,"d":"135,740.00"}},null,null,{"v":81871.39,"d":"81,871.39"}]
["Backhoe Loader",{"v":100000,"d":"100,000.00"},{"v":0.0812,"d":"0.08"},{"$f":"C3*B3","v":{"v":8119.999999999999,"d":"8,120.00"}},{"$f":"D3+B3","v":{"v":108120,"d":"108,120.00"}},{"$f":"E3*380","v":{"v":41085600,"d":"41,085,600.00"}},{"v":7,"d":"7.00"},{"$f":"F3/(G3*12*25)","v":{"v":19564.571428571428,"d":"19,564.57"}},{"v":90,"d":"90.00"},{"v":270,"d":"270.00"},{"$f":"H3*35%","v":{"v":6847.599999999999,"d":"6,847.60"}},{"$f":"J3*I3","v":{"v":24300,"d":"24,300.00"}},{"$f":"L3*8%","v":{"v":1944,"d":"1,944.00"}},{"$f":"M3+L3+K3+H3","v":{"v":52656.171428571426,"d":"52,656.17"}},{"v":10000,"d":"10,000.00"},{"$f":"O3+N3","v":{"v":62656.171428571426,"d":"62,656.17"}},null,2,"Backhoe Loader",{"$f":"ROUND(Z3,-3)","v":{"v":37000,"d":"37,000.00"}},{"$f":"L3","v":{"v":24300,"d":"24,300.00"}},{"v":10000,"d":"10,000.00"},{"$f":"T3+U3+V3","v":{"v":71300,"d":"71,300.00"}},null,null,{"v":36920.85,"d":"36,920.85"}]
["Bitumen Sprayer",{"v":174609.75316455695,"d":"174,609.75"},{"v":0.0812,"d":"0.08"},{"v":14178.311956962023,"d":"14,178.31"},{"v":188788.06512151897,"d":"188,788.07"},{"v":71739464.74617721,"d":"71,739,464.75"},{"v":7,"d":"7.00"},{"v":34161.649879132005,"d":"34,161.65"},{"v":100,"d":"100.00"},{"v":270,"d":"270.00"},{"v":11956.577457696201,"d":"11,956.58"},{"v":27000,"d":"27,000.00"},{"v":2160,"d":"2,160.00"},{"v":75278.2273368282,"d":"75,278.23"},{"v":10000,"d":"10,000.00"},{"v":85278.2273368282,"d":"85,278.23"},null,3,"Bitumen Sprayer",{"v":48000,"d":"48,000.00"},{"v":27000,"d":"27,000.00"},{"v":10000,"d":"10,000.00"},{"v":85000,"d":"85,000.00"},null,null,{"v":47802.82,"d":"47,802.82"}]
["CAT Bulldozer D9",{"v":666667,"d":"666,667.00"},{"v":0.0812,"d":"0.08"},{"v":54133.3604,"d":"54,133.36"},{"v":720800.3604,"d":"720,800.36"},{"v":273904136.952,"d":"273,904,136.95"},{"v":7,"d":"7.00"},{"v":130430.54140571429,"d":"130,430.54"},{"v":468,"d":"468.00"},{"v":270,"d":"270.00"},{"v":45650.689492,"d":"45,650.69"},{"v":126360,"d":"126,360.00"},{"v":10108.800000000001,"d":"10,108.80"},{"v":312550.0308977143,"d":"312,550.03"},{"v":10000,"d":"10,000.00"},{"v":322550.0308977143,"d":"322,550.03"},null,4,"CAT Bulldozer D9",{"v":236000,"d":"236,000.00"},{"v":126360,"d":"126,360.00"},{"v":10000,"d":"10,000.00"},{"v":372360,"d":"372,360.00"},null,null,{"v":236119.45,"d":"236,119.45"}]
["Cement Silos",{"v":10000,"d":"10,000.00"},{"v":0.23120000000000002,"d":"0.23"},{"v":2312,"d":"2,312.00"},{"v":12312,"d":"12,312.00"},{"v":4678560,"d":"4,678,560.00"},{"v":5,"d":"5.00"},{"v":3119.04,"d":"3,119.04"},{"v":0,"d":"0.00"},{"v":270,"d":"270.00"},{"v":1091.664,"d":"1,091.66"},{"v":0,"d":"0.00"},{"v":0,"d":"0.00"},{"v":4210.704,"d":"4,210.70"},{"v":10000,"d":"10,000.00"},{"v":14210.704,"d":"14,210.70"},null,5,"Cement Silos",{"v":2000,"d":"2,000.00"},{"v":0,"d":"0.00"},{"v":10000,"d":"10,000.00"},{"v":12000,"d":"12,000.00"},null,null,{"v":1702.13,"d":"1,702.13"}]
["Compressor 7Bar",{"v":30000,"d":"30,000.00"},{"v":0.13119999999999998,"d":"0.13"},{"v":3935.9999999999995,"d":"3,936.00"},{"v":33936,"d":"33,936.00"},{"v":12895680,"d":"12,895,680.00"},{"v":5,"d":"5.00"},{"v":8597.12,"d":"8,597.12"},{"v":123,"d":"123.00"},{"v":270,"d":"270.00"},{"v":3008.992,"d":"3,008.99"},{"v":33210,"d":"33,210.00"},{"v":2656.8,"d":"2,656.80"},{"v":47472.912000000004,"d":"47,472.91"},{"v":10000,"d":"10,000.00"},{"v":57472.912000000004,"d":"57,472.91"},null,6,"Compressor 7Bar",{"v":41000,"d":"41,000.00"},{"v":33210,"d":"33,210.00"},{"v":10000,"d":"10,000.00"},{"v":84210,"d":"84,210.00"},null,null,{"v":40558.45,"d":"40,558.45"}]
["Double Drum  Roller 10Ton",{"v":110000,"d":"110,000.00"},{"v":0.0812,"d":"0.08"},{"v":8932,"d":"8,932.00"},{"v":118932,"d":"118,932.00"},{"v":45194160,"d":"45,194,160.00"},{"v":7,"d":"7.00"},{"v":21521.02857142857,"d":"21,521.03"},{"v":100,"d":"100.00"},{"v":270,"d":"270.00"},{"v":7532.36,"d":"7,532.36"},{"v":27000,"d":"27,000.00"},{"v":2160,"d":"2,160.00"},{"v":58213.38857142857,"d":"58,213.39"},{"v":10000,"d":"10,000.00"},{"v":68213.38857142857,"d":"68,213.39"},null,7,"Double Drum  Roller 10Ton",{"v":41000,"d":"41,000.00"},{"v":27000,"d":"27,000.00"},{"v":10000,"d":"10,000.00"},{"v":78000,"d":"78,000.00"},null,null,{"v":40904.54,"d":"40,904.54"}]
["Double Drum  Roller 8Ton",{"v":90000,"d":"90,000.00"},{"v":0.0812,"d":"0.08"},{"v":7307.999999999999,"d":"7,308.00"},{"v":97308,"d":"97,308.00"},{"v":36977040,"d":"36,977,040.00"},{"v":7,"d":"7.00"},{"v":17608.114285714284,"d":"17,608.11"},{"v":100,"d":"100.00"},{"v":270,"d":"270.00"},{"v":6162.839999999999,"d":"6,162.84"},{"v":27000,"d":"27,000.00"},{"v":2160,"d":"2,160.00"},{"v":52930.95428571428,"d":"52,930.95"},{"v":10000,"d":"10,000.00"},{"v":62930.95428571428,"d":"62,930.95"},null,8,"Double Drum  Roller 8Ton",{"v":42000,"d":"42,000.00"},{"v":27000,"d":"27,000.00"},{"v":10000,"d":"10,000.00"},{"v":79000,"d":"79,000.00"},null,null,{"v":41627.59,"d":"41,627.59"}]
["Excavator (2 M3 ) ",{"v":381600,"d":"381,600.00"},{"v":0.0812,"d":"0.08"},{"v":30985.92,"d":"30,985.92"},{"v":412585.92,"d":"412,585.92"},{"v":156782649.6,"d":"156,782,649.60"},{"v":7,"d":"7.00"},{"v":74658.40457142857,"d":"74,658.40"},{"v":200,"d":"200.00"},{"v":270,"d":"270.00"},{"v":26130.4416,"d":"26,130.44"},{"v":54000,"d":"54,000.00"},{"v":4320,"d":"4,320.00"},{"v":159108.84617142857,"d":"159,108.85"},{"v":10000,"d":"10,000.00"},{"v":169108.84617142857,"d":"169,108.85"},null,9,"Excavator (2 M3 ) ",{"v":99000,"d":"99,000.00"},{"v":54000,"d":"54,000.00"},{"v":10000,"d":"10,000.00"},{"v":163000,"d":"163,000.00"},null,null,{"v":99062.86,"d":"99,062.86"}]
{"$rows_left_out":14}
{"sheet":"03 Labour","index":4,"n_rows":6,"n_cols":7,"rows_kept":6}
["S/NO","CATEGORY","RATE/DY","RATE/HR","QTY","DUR\n(12mths x 25dys)","AMOUNT"]
[1,"Unskilled Labour",{"v":2500,"d":"2,500.00"},{"$f":"C2/8","v":{"v":312.5,"d":"312.50"}},{"v":65,"d":"65.00"},{"$f":"11*25","v":{"v":275,"d":"275.00"}},{"$f":"F2*E2*C2","v":{"v":44687500,"d":"44,687,500.00"}}]
[2,"Semi Skilled",{"v":3500,"d":"3,500.00"},{"$f":"C3/8","v":{"v":437.5,"d":"437.50"}},{"v":40,"d":"40.00"},{"$f":"11*25","v":{"v":275,"d":"275.00"}},{"$f":"F3*E3*C3","v":{"v":38500000,"d":"38,500,000.00"}}]
[3,"Skilled",{"v":5000,"d":"5,000.00"},{"v":625,"d":"625.00"},{"v":18,"d":"18.00"},{"v":275,"d":"275.00"},{"v":24750000,"d":"24,750,000.00"}]
[4,"Operator",{"v":10000,"d":"10,000.00"},{"v":1250,"d":"1,250.00"},{"v":7,"d":"7.00"},{"v":275,"d":"275.00"},{"v":19250000,"d":"19,250,000.00"}]
[{"$nulls":6},{"$f":"SUM(G2:G5)","v":{"v":127187500,"d":"127,187,500.00"}}]

{"sheet":"04 Subcontract","index":5,"n_rows":22,"n_cols":13,"rows_kept":22,"merged":[[0,0,0,12],[1,4,1,6],[1,7,1,9],[1,10,1,12],[2,4,2,6],[2,7,2,9],[2,10,2,12],[3,5,3,6],[3,8,3,9],[3,11,3,12],[4,5,4,6],[4,8,4,9],[4,11,4,12],[5,5,5,6],[5,8,5,9],[5,11,5,12],[19,4,19,6],[19,7,19,9],[19,10,19,12],[20,4,20,6],[20,7,20,9],[20,10,20,12],[21,4,21,6],[21,7,21,9],[21,10,21,12]]}
["SUBCONTRACTOR ADJUDICATION"]
[{"$nulls":4},"Subcontractor 1",null,null,"Subcontractor 2",null,null,"Subcontractor 3"]
[null,"ALUMINIUM WINDOWS AND SUB FRAMES",null,null,{"$f":"G19","v":{"v":25715604.330000006,"d":"25,715,604.33"}},null,null,{"$f":"J19","v":{"v":25690538.1375,"d":"25,690,538.14"}},null,null,{"$f":"M19","v":{"v":25981687.631249998,"d":"25,981,687.63"}}]
[{"$nulls":4},{"$f":"50000/G7","v":{"v":2.1693856299895868E-3,"d":"0.22%"}},"Transportation",null,{"$f":"150000/J7","v":{"v":0.006721333512568894,"d":"0.67%"}},"Transportation",null,{"$f":"250000/M7","v":{"v":0.010494500881538074,"d":"1.05%"}},"Transportation"]
[null,"Accepted Quotation","Sub 2",null,{"v":0.01,"d":"1.00%"},"Stamp Duty",null,{"v":0.01,"d":"1.00%"},"Stamp Duty",null,{"v":0.01,"d":"1.00%"},"Stamp Duty"]
[{"$nulls":4},{"v":0.005,"d":"0.50%"},"Special Charge",null,{"v":0.02,"d":"2.00%"},"Special Charge",null,{"v":0,"d":"0.00%"},"Special Charge"]
[{"$nulls":4},"Factor",{"$f":"ROUND(SUM(E4:E6),4)+1","v":{"v":1.0172,"d":"1.017"}},{"$f":"E10*$C10+E13*$C13","v":{"v":23048000,"d":"23,048,000.00"}},"Factor",{"$f":"ROUND(SUM(H4:H6),4)+1","v":{"v":1.0367,"d":"1.037"}},{"$f":"H10*$C10+H13*$C13","v":{"v":22317000,"d":"22,317,000.00"}},"Factor",{"$f":"ROUND(SUM(K4:K6),4)+1","v":{"v":1.0205,"d":"1.021"}},{"$f":"K10*$C10+K13*$C13","v":{"v":23822000,"d":"23,822,000.00"}}]
["REF","DESCRIPTION","QTY","UNIT","RATE","ADJUSTED","AMOUNT","RATE","ADJUSTED","AMOUNT","RATE","ADJUSTED","AMOUNT"]
[null,"1.23 WINDOWS, SCREENS AND LIGHTS"]
["1.1.0","Aluminium Windows and Window frames, 1.5x1.5m high) finished with 5mm thick tinted glass, fixed to pre-installed 25mm square pipe subframe burined in concrete/blockworks",{"$f":"BOQ!C23","v":{"v":86,"d":"86.00"}},"nr",{"v":250000,"d":"250,000"},{"$f":"E10*F$7","v":{"v":254300.00000000003,"d":"254,300.00"}},{"$f":"F10*$C10","v":{"v":21869800.000000004,"d":"21,869,800.00"}},{"v":245000,"d":"245,000"},{"$f":"H10*I$7","v":{"v":253991.5,"d":"253,991.50"}},{"$f":"I10*$C10","v":{"v":21843269,"d":"21,843,269.00"}},{"v":265000,"d":"265,000"},{"$f":"K10*L$7","v":{"v":270432.5,"d":"270,432.50"}},{"$f":"L10*$C10","v":{"v":23257195,"d":"23,257,195.00"}}]
{"$rows_left_out":13}
{"sheet":"05 Built-in Preliminaries","index":6,"n_rows":53,"n_cols":10,"rows_kept":53,"merged":[[52,7,52,8]]}
["REF","S/NO","PRELIMINARY ITEM","QTY","RATE","DUR","AMOUNT","FIXED","TIME"]
[]
["A",null,"PROJECT STAFF"]
[null,1,"Project Manager",1,{"v":300000,"d":"300,000"},12,{"$f":"F4*E4*D4","v":{"v":3600000,"d":"3,600,000"}}]
[null,2,"Quantity Surveyor",1,{"v":250000,"d":"250,000"},10,{"$f":"F5*E5*D5","v":{"v":2500000,"d":"2,500,000"}}]
[null,3,"Assistant QS",1,{"v":180000,"d":"180,000"},8,{"v":1440000,"d":"1,440,000"}]
[null,4,"Site Engineer",2,{"v":200000,"d":"200,000"},12,{"v":4800000,"d":"4,800,000"}]
[null,5,"Accountant",1,{"v":145000,"d":"145,000"},12,{"v":1740000,"d":"1,740,000"}]
[{"$nulls":6},{"$f":"SUM(G4:G8)","v":{"v":14080000,"d":"14,080,000"}},null,{"$f":"G9","v":{"v":14080000,"d":"14,080,000.00"}}]
[]
{"$rows_left_out":44}
{"sheet":"06 Material Transp.","index":7,"n_rows":22,"n_cols":5,"rows_kept":22,"merged":[[0,0,0,3]]}
["MATERIAL TRANSPORTATION COST"]
[]
[null,"Distance to Quarry",{"v":150,"d":"150.0"},"Km"]
[null,"Truck Travel Speed",{"v":55,"d":"55.0"},"Km / Hr."]
[null,"Travel time (minutes)",{"$f":"C3/C4*60","v":{"v":163.63636363636363,"d":"163.64"}},"Min."]
[null,"Total Time Return Trip",{"$f":"C5*2+10+5","v":{"v":342.27272727272725,"d":"342.27"}},"Min."]
[{"$nulls":3},"Use:"]
[null,"Trips /Tipper/ day",{"$f":"8*60/C6","v":{"v":1.402390438247012,"d":"1.40"}},{"$f":"ROUND(C8,0)","v":{"v":1,"d":"1.0"}},"Trips/Day"]
[]
[null,"Delivery Cost of Cement Transportation",{"v":350000,"d":"350,000.0"},"Cost / Trip"]
{"$rows_left_out":13}
{"sheet":"07 ExtraOver Haulage","index":8,"n_rows":23,"n_cols":5,"rows_kept":23,"merged":[[0,0,0,3],[22,1,22,2]]}
["CALCULATION FOR EXTRA COST OF HAULAGE PER M3/KM"]
[]
[null,"CYCLE TIME CALCULATION"]
[null,"Distance  From Quarry/Burrow Pit To Site",{"v":12,"d":"12.00"},"Km"]
[null,"Tipper Speed  ( Km/Hr.)",{"v":45,"d":"45.00"},"Km / Hr."]
[null,"Time Of Travel ( Min.)",{"$f":"C4/C5*60","v":{"v":16,"d":"16.00"}},"Min."]
[null,"Time Of One Trip (Min.)",{"$f":"C6*2+10+10","v":{"v":52,"d":"52.00"}},"Min."]
[null,"No Of Trips\n/Tipper/Day",{"$f":"ROUND((6*60)/C7,0)","v":{"v":7,"d":"7.00"}}]
[]
[null,"COST OF USING EQUIPMENT"]
{"$rows_left_out":14}
{"sheet":"08 Concrete","index":9,"n_rows":35,"n_cols":7,"rows_kept":35}
[]
["Density","CONCRETE"]
[1.6,"sand",{"$f":"'01 Material Prices'!$C$5","v":{"v":3000,"d":"3,000.00"}},"m3","20ton"]
[2.1,"granite",{"$f":"'01 Material Prices'!C4","v":{"v":12500,"d":"12,500.00"}},"m3","30ton"]
[]
[null,"Mix Ratio","Cement","Sand","Granite","m3"]
[null,null,{"v":1,"d":"1.00"},{"v":2,"d":"2.00"},{"v":4,"d":"4.00"},{"$f":"SUM(C7:E7)","v":{"v":7,"d":"7.00"}}]
[]
[null,"Shrinkage",{"v":0.45,"d":"45%"}]
[null,"Entrained Air",{"v":0.02,"d":"2%"}]
{"$rows_left_out":26}
{"sheet":"09 Asphalt Binder","index":10,"n_rows":40,"n_cols":5,"rows_kept":40,"merged":[[0,0,0,3]]}
["BREAKDOWN OF ASPHALT BINDER COURSE"]
[]
[null,"COST  OF MATERIAL",null,"BINDER COURSE"]
[]
[null,"Asphalt concrete Purchased from Plant",null,{"v":32000,"d":"32,000.0"},"N/TON"]
[null,"Transportation Cost (18km radius)",null,{"v":2500,"d":"2,500.0"},"N/Ton"]
[null,"Toll Fees / 35ton Truck",{"v":8000,"d":"8,000.0"}]
[null,"Toll fee per Ton",null,{"$f":"C7/35","v":{"v":228.57142857142858,"d":"228.6"}},"N/Ton"]
[null,"Material Cost to Site (Ton)",null,{"$f":"SUM(D5:D8)","v":{"v":34728.57142857143,"d":"34,728.6"}},"N/TON"]
[]
{"$rows_left_out":31}
{"sheet":"10 Blockworks","index":11,"n_rows":50,"n_cols":11,"rows_kept":50}
[]
[null,"BLOCK WORK","230mm",{"$nulls":4},"BLOCK WORK","150mm"]
[null,"230 Block supplied to site",{"$f":"'01 Material Prices'!C9","v":{"v":270,"d":"270.00"}},{"$nulls":4},"150 Block supplied to site",{"$f":"'01 Material Prices'!C10","v":{"v":225,"d":"225.00"}}]
[]
[null,"1 m2 of Block wall",{"v":10,"d":"10.00"},"pcs",{"$f":"C5*C3","v":{"v":2700,"d":"2,700.00"}},null,null,"1 m2 of Block wall",{"v":10,"d":"10.00"},"pcs",{"$f":"I5*I3","v":{"v":2250,"d":"2,250.00"}}]
[null,"Waste",{"v":0.1,"d":"10%"},null,{"$f":"E5*C6","v":{"v":270,"d":"270.00"}},null,null,"Waste",{"$f":"C6","v":{"v":0.1,"d":"10%"}},null,{"$f":"K5*I6","v":{"v":225,"d":"225.00"}}]
[{"$nulls":4},{"$f":"SUM(E5:E6)","v":{"v":2970,"d":"2,970.00"}},{"$nulls":5},{"$f":"SUM(K5:K6)","v":{"v":2475,"d":"2,475.00"}}]
[]
[null,"Mortar",{"$nulls":5},"Mortar"]
[null,"Mix Ratio",{"v":1,"d":"1.00"},{"v":6,"d":"6.00"},{"$f":"D10+C10","v":{"v":7,"d":"7.00"}},null,null,"Mix Ratio",{"v":1,"d":"1.00"},{"v":6,"d":"6.00"},{"$f":"J10+I10","v":{"v":7,"d":"7.00"}}]
{"$rows_left_out":41}
{"sheet":"11 Laterite Fillings","index":12,"n_rows":50,"n_cols":8,"rows_kept":50,"merged":[[0,0,0,3]]}
["Break Down of Laterite Backfilling"]
[]
[null,"Distance  To Brorrow Pit ",{"v":10,"d":"10.00"},"Km"]
[null,"Travel Speed ( Km/Hr.)",{"v":40,"d":"40.00"},"Km / Hr."]
[null,"Time Of One Direction ( Min.)",{"$f":"C3/C4*60","v":{"v":15,"d":"15.00"}},"Min."]
[null,"Time Of One Trip (Min.)",{"$f":"C5*2+10+10","v":{"v":50,"d":"50.00"}},"Min."]
[null,"No Of Trips /Tipper/Day",{"$f":"ROUND((8*60)/C6,0)","v":{"v":10,"d":"10.00"}},"Trips"]
[]
[null,"Daily Work Output from Experience",{"v":500,"d":"500.00"},"M3/ day"]
[null,"Using 11 m3/ Tipper Load",{"$f":"ROUND(C9/(C7*11),0)","v":{"v":5,"d":"5.00"}}]
{"$rows_left_out":41}
{"sheet":"12 Road Scarify","index":13,"n_rows":23,"n_cols":5,"rows_kept":23,"merged":[[0,0,0,3]]}
["BREAKDOWN OF PAVEMENT SCARIFICATION"]
[]
[null,"COST  OF EQUIPMENTS","Running  Cost","Total /day"]
[1,"CAT Bulldozer D9",{"$f":"VLOOKUP(B4,'02 Equipment'!$S$2:$W$22,4,)","v":{"v":10000,"d":"10,000.00"}},{"$f":"C4*A4","v":{"v":10000,"d":"10,000.00"}},"COST/ DAY"]
[1,"Wheel Loader 2.5 M3 ",{"$f":"VLOOKUP(B5,'02 Equipment'!$S$2:$W$22,4,)","v":{"v":10000,"d":"10,000.00"}},{"v":10000,"d":"10,000.00"},"COST/ DAY"]
[2,"Tipper Dumper Truck- 14M3",{"$f":"VLOOKUP(B6,'02 Equipment'!$S$2:$W$22,4,)","v":{"v":10000,"d":"10,000.00"}},{"v":20000,"d":"20,000.00"},"COST/ DAY"]
[0.5,"Motor Grader 270 Hp",{"$f":"VLOOKUP(B7,'02 Equipment'!$S$2:$W$22,4,)","v":{"v":10000,"d":"10,000.00"}},{"v":5000,"d":"5,000.00"},"COST/ DAY"]
[1,"Single Drum Soil Compactor, 10Ton",{"$f":"VLOOKUP(B8,'02 Equipment'!$S$2:$W$22,4,)","v":{"v":10000,"d":"10,000.00"}},{"v":10000,"d":"10,000.00"},"COST/ DAY"]
[1,"Water Tanker",{"$f":"VLOOKUP(B9,'02 Equipment'!$S$2:$W$22,4,)","v":{"v":10000,"d":"10,000.00"}},{"v":10000,"d":"10,000.00"},"COST/ DAY"]
[{"$nulls":3},{"$f":"SUM(D4:D9)","v":{"v":65000,"d":"65,000.00"}},"COST/ DAY"]
{"$rows_left_out":14}
{"sheet":"13 Prime Coat","index":14,"n_rows":37,"n_cols":7,"rows_kept":37,"merged":[[0,0,0,4]]}
["BREAKDOWN OF PRIME COAT"]
[]
[null,"COST  OF MATERIAL"]
[null,"Supply Cost of MC-1 to Site",null,{"v":350000,"d":"350,000.00"},"COST/TON"]
[null,"VAT",{"v":0.075,"d":"7.50%"},{"$f":"D4*C5","v":{"v":26250,"d":"26,250.00"}}]
[{"$nulls":3},{"$f":"SUM(D4:D5)","v":{"v":376250,"d":"376,250.00"}},"COST/TON"]
[{"$nulls":3},{"$f":"D6/1000","v":376.25},"COST/LITER"]
[null,"Wastage",{"v":0.1,"d":"10%"},{"$f":"C8*D7","v":{"v":37.625,"d":"37.63"}},"COST/LITER"]
[{"$nulls":3},{"$f":"SUM(D7:D8)","v":{"v":413.875,"d":"413.88"}},"COST/LITER"]
[null,"Application Rate",null,{"v":1.3,"d":"1.30"},"lit/m2"]
{"$rows_left_out":27}